BDBM365670 US9868748, I-A54
SMILES CCS(=O)(=O)c1ccc(CC(=O)Nc2nc3[C@H](C(C)C)N(Cc4ccc(OC(F)F)cn4)Cc3s2)cc1
InChI Key InChIKey=UPULLKJXTHOIOP-QHCPKHFHSA-N
Data  1 KI
  Tab Delimited (TSV)   2D SDfile   Computed 3D by Vconf -m prep SDfile
Find this compound or compounds like it in BindingDB:
Activity Spreadsheet -- Enzyme Inhibition Constant Data from BindingDB
Found 1 hit for monomerid = 365670
TargetNuclear receptor ROR-gamma(Homo sapiens (Human))
Vitae Pharmaceuticals
US Patent
LigandPNGBDBM365670(US9868748, I-A54)
Affinity DataKi: <100nM. Assay description: Compounds of the present invention were tested for ability to bind to RORγ in a cell-free competition assay with commercially available radio-li...
Ligand InfoPC cidPC sid
In DepthDetails US Patent